Target
D(2) dopamine receptor
Ligand
BDBM50275558
Substrate
Meas. Tech.
ChEMBL_492769 (CHEMBL939457)
IC50
1100±n/a nM
Citation
 Miller, NRDaniels, RNBridges, TMBrady, AEConn, PJLindsley, CW Synthesis and SAR of analogs of the M1 allosteric agonist TBPB. Part II: Amides, sulfonamides and ureas--the effect of capping the distal basic piperidine nitrogen. Bioorg Med Chem Lett 18:5443-7 (2008)  
Target
Name:
D(2) dopamine receptor
Synonyms:
D(2) dopamine receptor DOPAMINE D2 Long DRD2 Dopamine D2 receptor Dopamine D2 receptor (D2R) Dopamine2-like | d2
Type:
Cell-surface receptors
Mol. Mass.:
50647.10
Organism:
Homo sapiens (Human)
Description:
P14416
Residue:
443
  
Inhibitor
Name:
BDBM50275558
Synonyms:
4-(4-fluoro-2-oxo-2,3-dihydro-1H-benzo[d]imidazol-1-yl)-N-(3-(trifluoromethylthio)phenyl)-1,4'-bipiperidine-1'-carboxamide | CHEMBL487788
Type:
Small organic molecule
Emp. Form.:
C25H27F4N5O2S
Mol. Mass.:
537.573
SMILES:
Fc1cccc2n(C3CCN(CC3)C3CCN(CC3)C(=O)Nc3cccc(SC(F)(F)F)c3)c(=O)[nH]c12
: