Target
Muscarinic acetylcholine receptor M2
Ligand
BDBM50275588
Substrate
Meas. Tech.
ChEMBL_492756 (CHEMBL939444)
EC50
11.9±n/a nM
Citation
 Miller, NRDaniels, RNBridges, TMBrady, AEConn, PJLindsley, CW Synthesis and SAR of analogs of the M1 allosteric agonist TBPB. Part II: Amides, sulfonamides and ureas--the effect of capping the distal basic piperidine nitrogen. Bioorg Med Chem Lett 18:5443-7 (2008)  
Target
Name:
Muscarinic acetylcholine receptor M2
Synonyms:
ACM2_HUMAN Cholinergic, muscarinic M2 Muscarinic acetylcholine receptor M2 and M5 | RecName: Full=Muscarinic acetylcholine receptor M2
Type:
GPCR
Mol. Mass.:
51730.61
Organism:
Homo sapiens (Human)
Description:
P08172
Residue:
466
  
Inhibitor
Name:
BDBM50275588
Synonyms:
2-(4-(2-oxo-2,3-dihydro-1H-benzo[d]imidazol-1-yl)-1,4'-bipiperidin-1'-yl)ethyl carbamate | CHEMBL485913
Type:
Small organic molecule
Emp. Form.:
C20H29N5O3
Mol. Mass.:
387.476
SMILES:
NC(=O)OCCN1CCC(CC1)N1CCC(CC1)n1c2ccccc2[nH]c1=O
: