Target
Muscarinic acetylcholine receptor M3
Ligand
BDBM50275560
Substrate
Meas. Tech.
ChEMBL_492758 (CHEMBL939446)
EC50
>30000±n/a nM
Citation
 Miller, NRDaniels, RNBridges, TMBrady, AEConn, PJLindsley, CW Synthesis and SAR of analogs of the M1 allosteric agonist TBPB. Part II: Amides, sulfonamides and ureas--the effect of capping the distal basic piperidine nitrogen. Bioorg Med Chem Lett 18:5443-7 (2008)  
Target
Name:
Muscarinic acetylcholine receptor M3
Synonyms:
ACM3_HUMAN Cholinergic, muscarinic M3 Muscarinic receptor M3 | RecName: Full=Muscarinic acetylcholine receptor M3
Type:
Enzyme
Mol. Mass.:
66151.03
Organism:
Homo sapiens (Human)
Description:
P20309
Residue:
590
  
Inhibitor
Name:
BDBM50275560
Synonyms:
4-(5-chloro-2-oxo-2,3-dihydro-1H-benzo[d]imidazol-1-yl)-N-(3-(trifluoromethylthio)phenyl)-1,4'-bipiperidine-1'-carboxamide | CHEMBL487986
Type:
Small organic molecule
Emp. Form.:
C25H27ClF3N5O2S
Mol. Mass.:
554.027
SMILES:
FC(F)(F)Sc1cccc(NC(=O)N2CCC(CC2)N2CCC(CC2)n2c3ccc(Cl)cc3[nH]c2=O)c1
: