Target
Lactoperoxidase
Ligand
BDBM50241361
Substrate
Meas. Tech.
ChEMBL_493330 (CHEMBL952393)
IC50
11800±n/a nM
Citation
 Das, DRoy, GMugesh, G Antithyroid drug carbimazole and its analogues: synthesis and inhibition of peroxidase-catalyzed iodination of L-tyrosine. J Med Chem 51:7313-7 (2009)  
Target
Name:
Lactoperoxidase
Synonyms:
LPO SAPX
Type:
PROTEIN
Mol. Mass.:
80305.60
Organism:
Homo sapiens (Human)
Description:
ChEMBL_493330
Residue:
712
  
Inhibitor
Name:
BDBM50241361
Synonyms:
CHEMBL1515 US9138393, Methimazole | US9144538, Methimazole
Type:
Small organic molecule
Emp. Form.:
C4H6N2S
Mol. Mass.:
114.169
SMILES:
Cn1cc[nH]c1=S
: