Target
Lactoperoxidase
Ligand
BDBM50275889
Substrate
Meas. Tech.
ChEMBL_493330 (CHEMBL952393)
IC50
10400±n/a nM
Citation
 Das, DRoy, GMugesh, G Antithyroid drug carbimazole and its analogues: synthesis and inhibition of peroxidase-catalyzed iodination of L-tyrosine. J Med Chem 51:7313-7 (2009)  
Target
Name:
Lactoperoxidase
Synonyms:
LPO SAPX
Type:
PROTEIN
Mol. Mass.:
80305.60
Organism:
Homo sapiens (Human)
Description:
ChEMBL_493330
Residue:
712
  
Inhibitor
Name:
BDBM50275889
Synonyms:
CHEMBL508102 | carbimazole
Type:
Small organic molecule
Emp. Form.:
C7H10N2O2S
Mol. Mass.:
186.232
SMILES:
CCOC(=O)n1ccn(C)c1=S
: