Target
Lactoperoxidase
Ligand
BDBM50275891
Substrate
Meas. Tech.
ChEMBL_493330 (CHEMBL952393)
IC50
10700±n/a nM
Citation
 Das, DRoy, GMugesh, G Antithyroid drug carbimazole and its analogues: synthesis and inhibition of peroxidase-catalyzed iodination of L-tyrosine. J Med Chem 51:7313-7 (2009)  
Target
Name:
Lactoperoxidase
Synonyms:
LPO SAPX
Type:
PROTEIN
Mol. Mass.:
80305.60
Organism:
Homo sapiens (Human)
Description:
ChEMBL_493330
Residue:
712
  
Inhibitor
Name:
BDBM50275891
Synonyms:
CHEMBL444464 | methyl 3-methyl-2-thioxo-2,3-dihydro-1H-imidazole-1-carboxylate
Type:
Small organic molecule
Emp. Form.:
C6H8N2O2S
Mol. Mass.:
172.205
SMILES:
COC(=O)n1ccn(C)c1=S
: