Target
Lactoperoxidase
Ligand
BDBM50275944
Substrate
Meas. Tech.
ChEMBL_493330 (CHEMBL952393)
IC50
25300±n/a nM
Citation
 Das, DRoy, GMugesh, G Antithyroid drug carbimazole and its analogues: synthesis and inhibition of peroxidase-catalyzed iodination of L-tyrosine. J Med Chem 51:7313-7 (2009)  
Target
Name:
Lactoperoxidase
Synonyms:
LPO SAPX
Type:
PROTEIN
Mol. Mass.:
80305.60
Organism:
Homo sapiens (Human)
Description:
ChEMBL_493330
Residue:
712
  
Inhibitor
Name:
BDBM50275944
Synonyms:
CHEMBL459114 | methyl 3-ethyl-2-selenoxo-2,3-dihydro-1H-imidazole-1-carboxylate
Type:
Small organic molecule
Emp. Form.:
C7H10N2O2Se
Mol. Mass.:
233.13
SMILES:
CCn1ccn(C(=O)OC)[c]1=[Se]
: