Target
Thyroid hormone receptor alpha
Ligand
BDBM50274814
Substrate
Meas. Tech.
ChEMBL_493724 (CHEMBL949479)
Ki
186±n/a nM
Citation
 Boyer, SHJiang, HJacintho, JDReddy, MVLi, HLi, WGodwin, JLSchulz, WGCable, EEHou, JWu, RFujitaki, JMHecker, SJErion, MD Synthesis and biological evaluation of a series of liver-selective phosphonic acid thyroid hormone receptor agonists and their prodrugs. J Med Chem 51:7075-93 (2009)  
Target
Name:
Thyroid hormone receptor alpha
Synonyms:
C-erbA-alpha EAR7 NR1A1 THA_HUMAN THRA1 Thyroid Hormone Receptor (TR-alpha) Thyroid hormone receptor alpha c-erbA-1
Type:
Receptor
Mol. Mass.:
54818.00
Organism:
Homo sapiens (Human)
Description:
Recombinant hThR was obtained from nuclear extracts from SF9 cells infected with baculovirus vectors encoding for ThRalpha 1.
Residue:
490
  
Inhibitor
Name:
BDBM50274814
Synonyms:
CHEMBL516330 | [3,5-Dichloro-4-(4'-hydroxy-3'-isopropylphenoxy)phenylamino]methylphosphonic Acid
Type:
Small organic molecule
Emp. Form.:
C16H18Cl2NO5P
Mol. Mass.:
406.198
SMILES:
CC(C)c1cc(Oc2c(Cl)cc(NCP(O)(O)=O)cc2Cl)ccc1O
: