Target
Thyroid hormone receptor beta
Ligand
BDBM50275228
Substrate
Meas. Tech.
ChEMBL_493725 (CHEMBL949480)
Ki
9.72±n/a nM
Citation
 Boyer, SHJiang, HJacintho, JDReddy, MVLi, HLi, WGodwin, JLSchulz, WGCable, EEHou, JWu, RFujitaki, JMHecker, SJErion, MD Synthesis and biological evaluation of a series of liver-selective phosphonic acid thyroid hormone receptor agonists and their prodrugs. J Med Chem 51:7075-93 (2009)  
Target
Name:
Thyroid hormone receptor beta
Synonyms:
ERBA2 Nuclear receptor subfamily 1 group A member 2 THR1 c-erbA-2 | c-erbA-beta
Type:
Receptor
Mol. Mass.:
52793.62
Organism:
Homo sapiens (Human)
Description:
Recombinant hThR was obtained from nuclear extracts from SF9 cells infected with baculovirus vectors encoding for ThRbeta 1.
Residue:
461
  
Inhibitor
Name:
BDBM50275228
Synonyms:
CHEMBL485928 | [3,5-Dimethyl-4-(3'-ethyl-4'-hydroxybenzyl)phenoxy]methylphosphonicAcid
Type:
Small organic molecule
Emp. Form.:
C18H23O5P
Mol. Mass.:
350.346
SMILES:
CCc1cc(Cc2c(C)cc(OCP(O)(O)=O)cc2C)ccc1O
: