Target
Synaptic vesicular amine transporter
Ligand
BDBM50246444
Substrate
Meas. Tech.
ChEMBL_558456 (CHEMBL963862)
Ki
1620±n/a nM
Citation
 Zheng, GDwoskin, LPDeaciuc, AGCrooks, PA Synthesis and evaluation of a series of homologues of lobelane at the vesicular monoamine transporter-2. Bioorg Med Chem Lett 18:6509-12 (2008)  
Target
Name:
Synaptic vesicular amine transporter
Synonyms:
Monoamine transporter Solute carrier family 18 member 2 Synaptic vesicular amine transporter VMAT2_RAT Vesicular monoamine transporter 2 (VMAT2) | Vmat2
Type:
Protein
Mol. Mass.:
55689.58
Organism:
Rattus norvegicus (Rat)
Description:
Q01827
Residue:
515
  
Inhibitor
Name:
BDBM50246444
Synonyms:
(2S,6S)-2-benzyl-1-methyl-6-(3-phenylpropyl)piperidine | CHEMBL500548
Type:
Small organic molecule
Emp. Form.:
C22H29N
Mol. Mass.:
307.4724
SMILES:
CN1[C@@H](CCCc2ccccc2)CCC[C@H]1Cc1ccccc1
: