Target
Amine oxidase [flavin-containing] B
Ligand
BDBM50246017
Substrate
Meas. Tech.
ChEMBL_558908 (CHEMBL1022587)
IC50
48600±n/a nM
Citation
 Jayaprakash, VSinha, BNUcar, GErcan, A Pyrazoline-based mycobactin analogues as MAO-inhibitors. Bioorg Med Chem Lett 18:6362-8 (2008)  
Target
Name:
Amine oxidase [flavin-containing] B
Synonyms:
AOFB_RAT Amine oxidase [flavin-containing] B Monoamine Oxidase Type B (MAO-B) Monoamine oxidase B (MAO-B) Monoamine oxidase type B (MAOB) | Monoamine oxidase-B (MAO-B)
Type:
Enzyme
Mol. Mass.:
58469.65
Organism:
Rattus norvegicus (rat)
Description:
P19643
Residue:
520
  
Inhibitor
Name:
BDBM50246017
Synonyms:
5-(4-hydroxyphenyl)-N,3-diphenyl-4,5-dihydro-1H-pyrazole-1-carbothioamide | CHEMBL513995
Type:
Small organic molecule
Emp. Form.:
C22H19N3OS
Mol. Mass.:
373.471
SMILES:
Oc1ccc(cc1)C1CC(=NN1C(=S)Nc1ccccc1)c1ccccc1
: