Target
Amine oxidase [flavin-containing] B
Ligand
BDBM50246111
Substrate
Meas. Tech.
ChEMBL_558908 (CHEMBL1022587)
IC50
144470±n/a nM
Citation
 Jayaprakash, VSinha, BNUcar, GErcan, A Pyrazoline-based mycobactin analogues as MAO-inhibitors. Bioorg Med Chem Lett 18:6362-8 (2008)  
Target
Name:
Amine oxidase [flavin-containing] B
Synonyms:
AOFB_RAT Amine oxidase [flavin-containing] B Monoamine Oxidase Type B (MAO-B) Monoamine oxidase B (MAO-B) Monoamine oxidase type B (MAOB) | Monoamine oxidase-B (MAO-B)
Type:
Enzyme
Mol. Mass.:
58469.65
Organism:
Rattus norvegicus (rat)
Description:
P19643
Residue:
520
  
Inhibitor
Name:
BDBM50246111
Synonyms:
3-(2-hydroxyphenyl)-5-(4-hydroxyphenyl)-N-(2-methoxyphenyl)-4,5-dihydro-1H-pyrazole-1-carbothioamide | CHEMBL472570
Type:
Small organic molecule
Emp. Form.:
C23H21N3O3S
Mol. Mass.:
419.496
SMILES:
COc1ccccc1NC(=S)N1N=C(CC1c1ccc(O)cc1)c1ccccc1O
: