Target
Amine oxidase [flavin-containing] A
Ligand
BDBM50245867
Substrate
Meas. Tech.
ChEMBL_558907 (CHEMBL1022586)
IC50
2840±n/a nM
Citation
 Jayaprakash, VSinha, BNUcar, GErcan, A Pyrazoline-based mycobactin analogues as MAO-inhibitors. Bioorg Med Chem Lett 18:6362-8 (2008)  
Target
Name:
Amine oxidase [flavin-containing] A
Synonyms:
AOFA_RAT Amine oxidase [flavin-containing] A Monoamine Oxidase Type A (MAO-A) Monoamine oxidase A (MAO-A) Monoamine oxidase type A (MAOA)
Type:
Enzyme
Mol. Mass.:
59515.21
Organism:
Rattus norvegicus (rat)
Description:
Residue:
526
  
Inhibitor
Name:
BDBM50245867
Synonyms:
3-(2-hydroxyphenyl)-5-(4-methoxyphenyl)-N-phenyl-4,5-dihydro-1H-pyrazole-1-carbothioamide | CHEMBL517888
Type:
Small organic molecule
Emp. Form.:
C23H21N3O2S
Mol. Mass.:
403.497
SMILES:
COc1ccc(cc1)C1CC(=NN1C(=S)Nc1ccccc1)c1ccccc1O
: