Target
Amine oxidase [flavin-containing] A
Ligand
BDBM50246149
Substrate
Meas. Tech.
ChEMBL_558907 (CHEMBL1022586)
IC50
144480±n/a nM
Citation
 Jayaprakash, VSinha, BNUcar, GErcan, A Pyrazoline-based mycobactin analogues as MAO-inhibitors. Bioorg Med Chem Lett 18:6362-8 (2008)  
Target
Name:
Amine oxidase [flavin-containing] A
Synonyms:
AOFA_RAT Amine oxidase [flavin-containing] A Monoamine Oxidase Type A (MAO-A) Monoamine oxidase A (MAO-A) Monoamine oxidase type A (MAOA)
Type:
Enzyme
Mol. Mass.:
59515.21
Organism:
Rattus norvegicus (rat)
Description:
Residue:
526
  
Inhibitor
Name:
BDBM50246149
Synonyms:
3,5-bis(2-hydroxyphenyl)-N-(2-methoxyphenyl)-4,5-dihydro-1H-pyrazole-1-carbothioamide | CHEMBL511459
Type:
Small organic molecule
Emp. Form.:
C23H21N3O3S
Mol. Mass.:
419.496
SMILES:
COc1ccccc1NC(=S)N1N=C(CC1c1ccccc1O)c1ccccc1O
: