Target
Amine oxidase [flavin-containing] A
Ligand
BDBM50246202
Substrate
Meas. Tech.
ChEMBL_558907 (CHEMBL1022586)
IC50
170260±n/a nM
Citation
 Jayaprakash, VSinha, BNUcar, GErcan, A Pyrazoline-based mycobactin analogues as MAO-inhibitors. Bioorg Med Chem Lett 18:6362-8 (2008)  
Target
Name:
Amine oxidase [flavin-containing] A
Synonyms:
AOFA_RAT Amine oxidase [flavin-containing] A Monoamine Oxidase Type A (MAO-A) Monoamine oxidase A (MAO-A) Monoamine oxidase type A (MAOA)
Type:
Enzyme
Mol. Mass.:
59515.21
Organism:
Rattus norvegicus (rat)
Description:
Residue:
526
  
Inhibitor
Name:
BDBM50246202
Synonyms:
3,5-bis(2-hydroxyphenyl)-N-o-tolyl-4,5-dihydro-1H-pyrazole-1-carbothioamide | CHEMBL487249
Type:
Small organic molecule
Emp. Form.:
C23H21N3O2S
Mol. Mass.:
403.497
SMILES:
Cc1ccccc1NC(=S)N1N=C(CC1c1ccccc1O)c1ccccc1O
: