Target
Cyclin-dependent kinase 2
Ligand
BDBM50246256
Substrate
Meas. Tech.
ChEMBL_558912 (CHEMBL1022591)
IC50
8±n/a nM
Citation
 Jones, CDAndrews, DMBarker, AJBlades, KByth, KFFinlay, MRGeh, CGreen, CPJohannsen, MWalker, MWeir, HM Imidazole pyrimidine amides as potent, orally bioavailable cyclin-dependent kinase inhibitors. Bioorg Med Chem Lett 18:6486-9 (2008)  
Target
Name:
Cyclin-dependent kinase 2
Synonyms:
CDK2 CDK2_HUMAN Cell division protein kinase 2 Protein cereblon/Cyclin-dependent kinase 2 | p33 protein kinase
Type:
Enzyme Subunit
Mol. Mass.:
33938.17
Organism:
Homo sapiens (Human)
Description:
P24941
Residue:
298
  
Inhibitor
Name:
BDBM50246256
Synonyms:
4-(4-(1-isopropyl-2-methyl-1H-imidazol-5-yl)pyrimidin-2-ylamino)-N,N-dimethylbenzamide | CHEMBL488085
Type:
Small organic molecule
Emp. Form.:
C20H24N6O
Mol. Mass.:
364.4442
SMILES:
CC(C)n1c(C)ncc1-c1ccnc(Nc2ccc(cc2)C(=O)N(C)C)n1
: