Target
Activated CDC42 kinase 1
Ligand
BDBM50246212
Substrate
Meas. Tech.
ChEMBL_559411 (CHEMBL1017265)
Ki
>2500±n/a nM
Citation
 Kopecky, DJHao, XChen, YFu, JJiao, XJaen, JCCardozo, MGLiu, JWang, ZWalker, NPWesche, HLi, SFarrelly, EXiao, SHKayser, F Identification and optimization of N3,N6-diaryl-1H-pyrazolo[3,4-d]pyrimidine-3,6-diamines as a novel class of ACK1 inhibitors. Bioorg Med Chem Lett 18:6352-6 (2008)  
Target
Name:
Activated CDC42 kinase 1
Synonyms:
ACK1 Activated CDC42 kinase 1 (ACK-1) Tyrosine kinase non-receptor protein 2
Type:
Protein
Mol. Mass.:
114577.86
Organism:
Homo sapiens (Human)
Description:
Q07912
Residue:
1038
  
Inhibitor
Name:
BDBM50246212
Synonyms:
CHEMBL487048 | N3-mesityl-1-(3-methoxy-3-methylbutyl)-N6-phenyl-1H-pyrazolo[3,4-d]pyrimidine-3,6-diamine
Type:
Small organic molecule
Emp. Form.:
C26H32N6O
Mol. Mass.:
444.5719
SMILES:
COC(C)(C)CCn1nc(Nc2c(C)cc(C)cc2C)c2cnc(Nc3ccccc3)nc12
: