Target
Activated CDC42 kinase 1
Ligand
BDBM50245852
Substrate
Meas. Tech.
ChEMBL_559412 (CHEMBL1017266)
Ki
20±n/a nM
Citation
 Kopecky, DJHao, XChen, YFu, JJiao, XJaen, JCCardozo, MGLiu, JWang, ZWalker, NPWesche, HLi, SFarrelly, EXiao, SHKayser, F Identification and optimization of N3,N6-diaryl-1H-pyrazolo[3,4-d]pyrimidine-3,6-diamines as a novel class of ACK1 inhibitors. Bioorg Med Chem Lett 18:6352-6 (2008)  
Target
Name:
Activated CDC42 kinase 1
Synonyms:
ACK1 Activated CDC42 kinase 1 (ACK-1) Tyrosine kinase non-receptor protein 2
Type:
Protein
Mol. Mass.:
114577.86
Organism:
Homo sapiens (Human)
Description:
Q07912
Residue:
1038
  
Inhibitor
Name:
BDBM50245852
Synonyms:
CHEMBL458333 | N3-(2,6-dimethylphenyl)-1-(3-methoxy-3-methylbutyl)-N6-(4-(2-(pyrrolidin-1-yl)ethoxy)phenyl)-1H-pyrazolo[3,4-d]pyrimidine-3,6-diamine
Type:
Small organic molecule
Emp. Form.:
C31H41N7O2
Mol. Mass.:
543.7029
SMILES:
COC(C)(C)CCn1nc(Nc2c(C)cccc2C)c2cnc(Nc3ccc(OCCN4CCCC4)cc3)nc12
: