Target
Activated CDC42 kinase 1
Ligand
BDBM50245855
Substrate
Meas. Tech.
ChEMBL_559412 (CHEMBL1017266)
Ki
60±n/a nM
Citation
 Kopecky, DJHao, XChen, YFu, JJiao, XJaen, JCCardozo, MGLiu, JWang, ZWalker, NPWesche, HLi, SFarrelly, EXiao, SHKayser, F Identification and optimization of N3,N6-diaryl-1H-pyrazolo[3,4-d]pyrimidine-3,6-diamines as a novel class of ACK1 inhibitors. Bioorg Med Chem Lett 18:6352-6 (2008)  
Target
Name:
Activated CDC42 kinase 1
Synonyms:
ACK1 Activated CDC42 kinase 1 (ACK-1) Tyrosine kinase non-receptor protein 2
Type:
Protein
Mol. Mass.:
114577.86
Organism:
Homo sapiens (Human)
Description:
Q07912
Residue:
1038
  
Inhibitor
Name:
BDBM50245855
Synonyms:
CHEMBL450918 | N3-(2,6-dimethylphenyl)-N6-(3-fluoro-4-(3-(piperidin-1-yl)propoxy)phenyl)-1-(3-methoxy-3-methylbutyl)-1H-pyrazolo[3,4-d]pyrimidine-3,6-diamine
Type:
Small organic molecule
Emp. Form.:
C33H44FN7O2
Mol. Mass.:
589.7466
SMILES:
COC(C)(C)CCn1nc(Nc2c(C)cccc2C)c2cnc(Nc3ccc(OCCCN4CCCCC4)c(F)c3)nc12
: