Target
Activated CDC42 kinase 1
Ligand
BDBM50245861
Substrate
Meas. Tech.
ChEMBL_559412 (CHEMBL1017266)
Ki
60±n/a nM
Citation
 Kopecky, DJHao, XChen, YFu, JJiao, XJaen, JCCardozo, MGLiu, JWang, ZWalker, NPWesche, HLi, SFarrelly, EXiao, SHKayser, F Identification and optimization of N3,N6-diaryl-1H-pyrazolo[3,4-d]pyrimidine-3,6-diamines as a novel class of ACK1 inhibitors. Bioorg Med Chem Lett 18:6352-6 (2008)  
Target
Name:
Activated CDC42 kinase 1
Synonyms:
ACK1 Activated CDC42 kinase 1 (ACK-1) Tyrosine kinase non-receptor protein 2
Type:
Protein
Mol. Mass.:
114577.86
Organism:
Homo sapiens (Human)
Description:
Q07912
Residue:
1038
  
Inhibitor
Name:
BDBM50245861
Synonyms:
(R)-4-(3-(2,6-dimethylphenylamino)-6-(phenylamino)-1H-pyrazolo[3,4-d]pyrimidin-1-yl)butane-1,2-diol | CHEMBL461337
Type:
Small organic molecule
Emp. Form.:
C23H26N6O2
Mol. Mass.:
418.4915
SMILES:
Cc1cccc(C)c1Nc1nn(CC[C@@H](O)CO)c2nc(Nc3ccccc3)ncc12
: