Target
Polyphenol oxidase 2
Ligand
BDBM50245887
Substrate
Meas. Tech.
ChEMBL_559710 (CHEMBL1012868)
IC50
280000±n/a nM
Citation
 Yi, WCao, RWen, HYan, QZhou, BWan, YMa, LSong, H Synthesis and biological evaluation of helicid analogues as mushroom tyrosinase inhibitors. Bioorg Med Chem Lett 18:6490-3 (2008)  
Target
Name:
Polyphenol oxidase 2
Synonyms:
Monophenol monooxygenase PPO2 Tyrosinase
Type:
Protein
Mol. Mass.:
63923.66
Organism:
Agaricus bisporus (Common mushroom)
Description:
O42713
Residue:
556
  
Inhibitor
Name:
BDBM50245887
Synonyms:
4-((2S,3R,4R,5R)-3,4,5-trihydroxy-tetrahydro-2H-pyran-2-yloxy)benzaldehyde CHEMBL499285
Type:
Small organic molecule
Emp. Form.:
C12H14O6
Mol. Mass.:
254.236
SMILES:
O[C@@H]1CO[C@@H](Oc2ccc(C=O)cc2)[C@H](O)[C@@H]1O
: