Target
Adenosine receptor A3
Ligand
BDBM50254650
Substrate
Meas. Tech.
ChEMBL_559910 (CHEMBL1011021)
Ki
11.5±n/a nM
Citation
 Colotta, VCapelli, FLenzi, OCatarzi, DVarano, FPoli, DVincenzi, FVarani, KBorea, PADal Ben, DVolpini, RCristalli, GFilacchioni, G Novel potent and highly selective human A(3) adenosine receptor antagonists belonging to the 4-amido-2-arylpyrazolo[3,4-c]quinoline series: molecular docking analysis and pharmacological studies. Bioorg Med Chem 17:401-10 (2008)  
Target
Name:
Adenosine receptor A3
Synonyms:
A3 adenosine receptor (hA3) ADORA3 | Adenosine A3 receptor (A3AR)
Type:
G Protein-Coupled Receptor (GPCR)
Mol. Mass.:
36197.32
Organism:
Homo sapiens (Human)
Description:
P0DMS8
Residue:
318
  
Inhibitor
Name:
BDBM50254650
Synonyms:
CHEMBL464040 | N-(2-(4-chlorophenyl)-2H-pyrazolo[3,4-c]quinolin-4-yl)furan-2-carboxamide
Type:
Small organic molecule
Emp. Form.:
C21H13ClN4O2
Mol. Mass.:
388.807
SMILES:
Clc1ccc(cc1)-n1cc2c(n1)c(NC(=O)c1ccco1)nc1ccccc21
: