Target
Galanin receptor type 1
Ligand
BDBM50149871
Substrate
Meas. Tech.
ChEMBL_515047 (CHEMBL1034789)
IC50
3±n/a nM
Citation
 Terui, YChu, YWLi, JYAndo, TFukunaga, TAoki, TToda, Y New cyclic tetrapeptides from Nonomuraea sp. TA-0426 that inhibit glycine transporter type 1 (GlyT1). Bioorg Med Chem Lett 18:6321-3 (2008)  
Target
Name:
Galanin receptor type 1
Synonyms:
GALR1_RAT Galanin receptor type 1 Galnr1 | Galr1
Type:
Enzyme Catalytic Domain
Mol. Mass.:
38883.91
Organism:
RAT
Description:
Galanin R1 GALR1 RAT::Q62805
Residue:
346
  
Inhibitor
Name:
BDBM50149871
Synonyms:
(R)-2-((3-(biphenyl-4-yloxy)-3-(4-fluorophenyl)propyl)(methyl)amino)acetic acid {[(R)-3-(biphenyl-4-yloxy)-3-(4-fluoro-phenyl)-propyl]-methyl-amino}-acetic acid
Type:
Small organic molecule
Emp. Form.:
C24H24FNO3
Mol. Mass.:
393.4507
SMILES:
CN(CC[C@@H](Oc1ccc(cc1)-c1ccccc1)c1ccc(F)cc1)CC(O)=O
: