Target
AP2-associated protein kinase 1
Ligand
BDBM50273541
Substrate
Meas. Tech.
ChEMBL_537066 (CHEMBL986215)
Kd
53±n/a nM
Citation
 Bamborough, PDrewry, DHarper, GSmith, GKSchneider, K Assessment of chemical coverage of kinome space and its implications for kinase drug discovery. J Med Chem 51:7898-914 (2008)  
Target
Name:
AP2-associated protein kinase 1
Synonyms:
AAK1 Adaptor-associated kinase 1 | KIAA1048
Type:
PROTEIN
Mol. Mass.:
103884.23
Organism:
Homo sapiens (Human)
Description:
ChEMBL_774569
Residue:
961
  
Inhibitor
Name:
BDBM50273541
Synonyms:
CHEMBL516312 | N-(5-(4-cyanophenyl)-1H-pyrrolo[2,3-b]pyridin-3-yl)nicotinamide
Type:
Small organic molecule
Emp. Form.:
C20H13N5O
Mol. Mass.:
339.3501
SMILES:
O=C(Nc1c[nH]c2ncc(cc12)-c1ccc(cc1)C#N)c1cccnc1
: