Target
STE20-like serine/threonine-protein kinase
Ligand
BDBM50126419
Substrate
Meas. Tech.
ChEMBL_537109 (CHEMBL988941)
Kd
623±n/a nM
Citation
 Bamborough, PDrewry, DHarper, GSmith, GKSchneider, K Assessment of chemical coverage of kinome space and its implications for kinase drug discovery. J Med Chem 51:7898-914 (2008)  
Target
Name:
STE20-like serine/threonine-protein kinase
Synonyms:
KIAA0204 SLK_HUMAN Serine/threonine-protein kinase 2
Type:
PROTEIN
Mol. Mass.:
142644.38
Organism:
Homo sapiens (Human)
Description:
ChEMBL_1451342
Residue:
1235
  
Inhibitor
Name:
BDBM50126419
Synonyms:
CHEMBL282342 N1-(7-(4-(dimethylamino)phenyl)-1,6-naphthyridin-5-yl)butane-1,4-diamine
Type:
Small organic molecule
Emp. Form.:
C20H25N5
Mol. Mass.:
335.446
SMILES:
CN(C)c1ccc(cc1)-c1cc2ncccc2c(NCCCCN)n1
: