Target
Casein kinase I isoform alpha
Ligand
BDBM50273635
Substrate
Meas. Tech.
ChEMBL_537115 (CHEMBL988947)
Kd
225±n/a nM
Citation
 Bamborough, PDrewry, DHarper, GSmith, GKSchneider, K Assessment of chemical coverage of kinome space and its implications for kinase drug discovery. J Med Chem 51:7898-914 (2008)  
Target
Name:
Casein kinase I isoform alpha
Synonyms:
CK1 CSNK1A1 Casein kinase 1 alpha (CK1 alpha) KC1A_HUMAN
Type:
Serine/threonine-protein kinase
Mol. Mass.:
38936.59
Organism:
Homo sapiens (Human)
Description:
P48729
Residue:
337
  
Inhibitor
Name:
BDBM50273635
Synonyms:
1-(4-methyl-2,5-di(pyridin-4-yl)-1H-pyrrol-3-yl)ethanone | CHEMBL526901
Type:
Small organic molecule
Emp. Form.:
C17H15N3O
Mol. Mass.:
277.3205
SMILES:
CC(=O)c1c(C)c([nH]c1-c1ccncc1)-c1ccncc1
: