Target
MAP kinase-interacting serine/threonine-protein kinase 2
Ligand
BDBM50273636
Substrate
Meas. Tech.
ChEMBL_537118 (CHEMBL988950)
Kd
1230±n/a nM
Citation
 Bamborough, PDrewry, DHarper, GSmith, GKSchneider, K Assessment of chemical coverage of kinome space and its implications for kinase drug discovery. J Med Chem 51:7898-914 (2008)  
Target
Name:
MAP kinase-interacting serine/threonine-protein kinase 2
Synonyms:
GPRK7 MAP kinase-interacting serine/threonine-protein kinase 2 (MKNK2) MAP-kinase interacting kinase 2 (MNK2) MKNK2_HUMAN | MNK2
Type:
Protein
Mol. Mass.:
51870.79
Organism:
Homo sapiens (Human)
Description:
Q9HBH9
Residue:
465
  
Inhibitor
Name:
BDBM50273636
Synonyms:
4-(5-(4-fluorophenyl)-1H-pyrazol-3-ylamino)benzamide | CHEMBL511337
Type:
Small organic molecule
Emp. Form.:
C16H13FN4O
Mol. Mass.:
296.299
SMILES:
NC(=O)c1ccc(Nc2cc(n[nH]2)-c2ccc(F)cc2)cc1
: