Target
Glycogen synthase kinase-3 beta
Ligand
BDBM8344
Substrate
Meas. Tech.
ChEMBL_538128 (CHEMBL1025771)
IC50
8±n/a nM
Citation
 Bamborough, PDrewry, DHarper, GSmith, GKSchneider, K Assessment of chemical coverage of kinome space and its implications for kinase drug discovery. J Med Chem 51:7898-914 (2008)  
Target
Name:
Glycogen synthase kinase-3 beta
Synonyms:
GSK-3 beta GSK3B Glycogen synthase kinase 3 beta (GSK3B) Glycogen synthase kinase-3 beta (GSK-3B) Glycogen synthase kinase-3 beta (GSK3B) Glycogen synthase kinase-3beta (GSK3B) | Serine/threonine-protein kinase GSK3B
Type:
Enzyme
Mol. Mass.:
46756.38
Organism:
Homo sapiens (Human)
Description:
P49841
Residue:
420
  
Inhibitor
Name:
BDBM8344
Synonyms:
6-aryl-pyrazolo[3,4-b]pyridine analogue 8 N-[6-(3-hydroxyphenyl)-1H-pyrazolo[3,4-b]pyridin-3-yl]cyclopropanecarboxamide | pyrazolo[3,4-b]pyridine analogue 10
Type:
Small organic molecule
Emp. Form.:
C16H14N4O2
Mol. Mass.:
294.308
SMILES:
Oc1cccc(c1)-c1ccc2c(NC(=O)C3CC3)n[nH]c2n1
: