Target
TGF-beta receptor type-1
Ligand
BDBM21492
Substrate
Meas. Tech.
ChEMBL_538129 (CHEMBL1025772)
IC50
27±n/a nM
Citation
 Bamborough, PDrewry, DHarper, GSmith, GKSchneider, K Assessment of chemical coverage of kinome space and its implications for kinase drug discovery. J Med Chem 51:7898-914 (2008)  
Target
Name:
TGF-beta receptor type-1
Synonyms:
ALK-5 Activin A receptor type II-like protein kinase of 53kD SKR4 TGF-beta receptor type I TGFBR1 TGFR1_HUMAN Transforming growth factor-beta receptor type I
Type:
enzyme
Mol. Mass.:
55968.24
Organism:
Homo sapiens (Human)
Description:
P36897
Residue:
503
  
Inhibitor
Name:
BDBM21492
Synonyms:
4-[3-(pyridin-2-yl)-1H-pyrazol-4-yl]quinoline LY364947 US9138393, LY-364947 | US9144538, LY-364947
Type:
Small organic molecule
Emp. Form.:
C17H12N4
Mol. Mass.:
272.304
SMILES:
c1[nH]nc(c1-c1ccnc2ccccc12)-c1ccccn1
: