Target
Serine/threonine-protein kinase pim-1
Ligand
BDBM50273541
Substrate
Meas. Tech.
ChEMBL_537061 (CHEMBL986210)
Kd
35±n/a nM
Citation
 Bamborough, PDrewry, DHarper, GSmith, GKSchneider, K Assessment of chemical coverage of kinome space and its implications for kinase drug discovery. J Med Chem 51:7898-914 (2008)  
Target
Name:
Serine/threonine-protein kinase pim-1
Synonyms:
PIM-1 Kinase PIM1_HUMAN Serine/threonine-protein kinase (PIM1) Serine/threonine-protein kinase PIM1 | Serine/threonine-protein kinase pim-1 (PIM1)
Type:
Protein
Mol. Mass.:
35681.82
Organism:
Homo sapiens (Human)
Description:
P11309
Residue:
313
  
Inhibitor
Name:
BDBM50273541
Synonyms:
CHEMBL516312 | N-(5-(4-cyanophenyl)-1H-pyrrolo[2,3-b]pyridin-3-yl)nicotinamide
Type:
Small organic molecule
Emp. Form.:
C20H13N5O
Mol. Mass.:
339.3501
SMILES:
O=C(Nc1c[nH]c2ncc(cc12)-c1ccc(cc1)C#N)c1cccnc1
: