Target
Angiotensin-converting enzyme
Ligand
BDBM50266243
Substrate
Meas. Tech.
ChEMBL_544516 (CHEMBL1013488)
IC50
320±n/a nM
Citation
 Enomoto, HMorikawa, YMiyake, YTsuji, FMizuchi, MSuhara, HFujimura, KHoriuchi, MBan, M Synthesis and biological evaluation of N-mercaptoacylcysteine derivatives as leukotriene A4 hydrolase inhibitors. Bioorg Med Chem Lett 19:442-6 (2008)  
Target
Name:
Angiotensin-converting enzyme
Synonyms:
ACE Angiotensin converting enzyme (ACE) Angiotensin-converting enzyme, soluble form CD_antigen=CD143 DCP1 Kininase II
Type:
Enzyme
Mol. Mass.:
149709.01
Organism:
Homo sapiens (Human)
Description:
Residue:
1306
  
Inhibitor
Name:
BDBM50266243
Synonyms:
(R)-2-((S)-3-mercapto-2-methylpropanamido)-3-(4-nitrobenzylthio)propanoic acid | CHEMBL456278
Type:
Small organic molecule
Emp. Form.:
C14H18N2O5S2
Mol. Mass.:
358.433
SMILES:
C[C@H](CS)C(=O)N[C@@H](CSCc1ccc(cc1)[N+]([O-])=O)C(O)=O
: