Target
Coagulation factor X
Ligand
BDBM50266009
Substrate
Meas. Tech.
ChEMBL_544730 (CHEMBL1010168)
Ki
0.05±n/a nM
Citation
 Qiao, JXKing, SRHe, KWong, PCRendina, ARLuettgen, JMXin, BKnabb, RMWexler, RRLam, PY Highly efficacious factor Xa inhibitors containing alpha-substituted phenylcycloalkyl P4 moieties. Bioorg Med Chem Lett 19:462-8 (2008)  
Target
Name:
Coagulation factor X
Synonyms:
Activated coagulation factor X (FXa) Coagulation factor X precursor F10 Factor X heavy chain Factor Xa Stuart-Prower factor
Type:
Enzyme
Mol. Mass.:
54726.60
Organism:
Homo sapiens (Human)
Description:
Residue:
488
  
Inhibitor
Name:
BDBM50266009
Synonyms:
6-(4-(1-((dimethylamino)methyl)cyclopropyl)phenyl)-1-(4-methoxyphenyl)-3-(methylsulfonyl)-3a,4,5,6-tetrahydro-1H-pyrazolo[3,4-c]pyridin-7(7aH)-one | CHEMBL461667
Type:
Small organic molecule
Emp. Form.:
C26H32N4O4S
Mol. Mass.:
496.622
SMILES:
COc1ccc(cc1)N1N=C(C2CCN(C(=O)C12)c1ccc(cc1)C1(CN(C)C)CC1)S(C)(=O)=O
: