Target
Coagulation factor X
Ligand
BDBM50266049
Substrate
Meas. Tech.
ChEMBL_544730 (CHEMBL1010168)
Ki
0.04±n/a nM
Citation
 Qiao, JXKing, SRHe, KWong, PCRendina, ARLuettgen, JMXin, BKnabb, RMWexler, RRLam, PY Highly efficacious factor Xa inhibitors containing alpha-substituted phenylcycloalkyl P4 moieties. Bioorg Med Chem Lett 19:462-8 (2008)  
Target
Name:
Coagulation factor X
Synonyms:
Activated coagulation factor X (FXa) Coagulation factor X precursor F10 Factor X heavy chain Factor Xa Stuart-Prower factor
Type:
Enzyme
Mol. Mass.:
54726.60
Organism:
Homo sapiens (Human)
Description:
Residue:
488
  
Inhibitor
Name:
BDBM50266049
Synonyms:
1-(4-methoxyphenyl)-6-(4-(1-(morpholinomethyl)cyclopropyl)phenyl)-7-oxo-4,5,6,7-tetrahydro-1H-pyrazolo[3,4-c]pyridine-3-carboxamide | CHEMBL456676
Type:
Small organic molecule
Emp. Form.:
C28H31N5O4
Mol. Mass.:
501.5768
SMILES:
COc1ccc(cc1)-n1nc(C(N)=O)c2CCN(C(=O)c12)c1ccc(cc1)C1(CN2CCOCC2)CC1
: