Target
Sodium-dependent noradrenaline transporter
Ligand
BDBM50273641
Substrate
Meas. Tech.
ChEMBL_560916 (CHEMBL1013551)
Ki
2600±n/a nM
Citation
 Jin, CNavarro, HACarroll, FI Development of 3-phenyltropane analogues with high affinity for the dopamine and serotonin transporters and low affinity for the norepinephrine transporter. J Med Chem 51:8048-56 (2008)  
Target
Name:
Sodium-dependent noradrenaline transporter
Synonyms:
Monoamine transporter NET Noradrenaline Transporter (NET) Norepinephrine transporter protein (NET) SLC6A2 Sodium-dependent noradrenaline transporter (NET) | Solute carrier family 6 member 2
Type:
Multi-pass membrane protein
Mol. Mass.:
69337.72
Organism:
Homo sapiens (Human)
Description:
P23975
Residue:
617
  
Inhibitor
Name:
BDBM50273641
Synonyms:
(1R,2S,3S,5R)-4-amino-3,5-diiodophenethyl 3-(4-methoxyphenyl)-8-methyl-8-aza-bicyclo[3.2.1]octane-2-carboxylate hydrochloride | CHEMBL459333
Type:
Small organic molecule
Emp. Form.:
C24H28I2N2O3
Mol. Mass.:
646.2997
SMILES:
COc1ccc(cc1)[C@H]1C[C@H]2CC[C@H]([C@H]1C(=O)OCCc1cc(I)c(N)c(I)c1)N2C
: