Target
Protein ADM2
Ligand
BDBM50246690
Substrate
Meas. Tech.
ChEMBL_556927 (CHEMBL954953)
IC50
12±n/a nM
Citation
 Miranda, LPHolder, JRShi, LBennett, BAral, JGegg, CVWright, MWalker, KDoellgast, GRogers, RLi, HValladares, VSalyers, KJohnson, EWild, K Identification of potent, selective, and metabolically stable peptide antagonists to the calcitonin gene-related peptide (CGRP) receptor. J Med Chem 51:7889-97 (2008)  
Target
Name:
Protein ADM2
Synonyms:
ADM2 AM2
Type:
PROTEIN
Mol. Mass.:
15883.28
Organism:
Homo sapiens (Human)
Description:
ChEMBL_556927
Residue:
148
  
Inhibitor
Name:
BDBM50246690
Synonyms:
Ac-WVTHRLAGLLSRSGGVVRKNFVPTDVGPFAF-NH2 | CHEMBL503773
Type:
Small organic molecule
Emp. Form.:
C159H246N46O39
Mol. Mass.:
3425.9393
SMILES:
CC(C)C[C@H](NC(=O)CNC(=O)[C@H](C)NC(=O)[C@H](CC(C)C)NC(=O)[C@H](CCCN=C(N)N)NC(=O)[C@H](Cc1cnc[nH]1)NC(=O)[C@@H](NC(=O)[C@@H](NC(=O)[C@H](Cc1c[nH]c2ccccc12)NC(C)=O)C(C)C)[C@@H](C)O)C(=O)N[C@@H](CC(C)C)C(=O)N[C@@H](CO)C(=O)N[C@@H](CCCN=C(N)N)C(=O)N[C@@H](CO)C(=O)NCC(=O)NCC(=O)N[C@@H](C(C)C)C(=O)N[C@@H](C(C)C)C(=O)N[C@@H](CCCN=C(N)N)C(=O)N[C@@H](CCCCN)C(=O)N[C@@H](CC(N)=O)C(=O)N[C@@H](Cc1ccccc1)C(=O)N[C@@H](C(C)C)C(=O)N1CCC[C@H]1C(=O)N[C@@H]([C@@H](C)O)C(=O)N[C@@H](CC(O)=O)C(=O)N[C@@H](C(C)C)C(=O)NCC(=O)N1CCC[C@H]1C(=O)N[C@@H](Cc1ccccc1)C(=O)N[C@@H](C)C(=O)N[C@@H](Cc1ccccc1)C(N)=O
: