Target
Vasopressin V2 receptor
Ligand
BDBM50246925
Substrate
Meas. Tech.
ChEMBL_561010 (CHEMBL1015250)
EC50
13±n/a nM
Citation
 Yea, CMAllan, CEAshworth, DMBarnett, JBaxter, AJBroadbridge, JDFranklin, RJHampton, SLHudson, PHorton, JAJenkins, PDPenson, AMPitt, GRRivière, PRobson, PARooker, DPSemple, GSheppard, AHaigh, RMRoe, MB New benzylureas as a novel series of potent, nonpeptidic vasopressin V2 receptor agonists. J Med Chem 51:8124-34 (2008)  
Target
Name:
Vasopressin V2 receptor
Synonyms:
AVPR V2 Avpr2 V2R_RAT Vasopressin receptor
Type:
G-protein coupled receptor
Mol. Mass.:
40761.85
Organism:
Rattus norvegicus (Rat)
Description:
Residue:
371
  
Inhibitor
Name:
BDBM50246925
Synonyms:
1-(4-[3-(2,6-Difluorophenyl)ureidomethyl]-3-methylbenzoyl)-2,3,4,5-tetrahydro-1H-1-benzazepine | CHEMBL455699
Type:
Small organic molecule
Emp. Form.:
C26H25F2N3O2
Mol. Mass.:
449.4924
SMILES:
Cc1cc(ccc1CNC(=O)Nc1c(F)cccc1F)C(=O)N1CCCCc2ccccc12
: