Target
Vasopressin V2 receptor
Ligand
BDBM50246575
Substrate
Meas. Tech.
ChEMBL_560999 (CHEMBL1015239)
EC50
24±n/a nM
Citation
 Yea, CMAllan, CEAshworth, DMBarnett, JBaxter, AJBroadbridge, JDFranklin, RJHampton, SLHudson, PHorton, JAJenkins, PDPenson, AMPitt, GRRivière, PRobson, PARooker, DPSemple, GSheppard, AHaigh, RMRoe, MB New benzylureas as a novel series of potent, nonpeptidic vasopressin V2 receptor agonists. J Med Chem 51:8124-34 (2008)  
Target
Name:
Vasopressin V2 receptor
Synonyms:
ADHR AVPR2 DIR Renal-type arginine vasopressin receptor V2R_HUMAN Vasopressin V2 receptor | Vasopressin receptor
Type:
Receptor
Mol. Mass.:
40295.28
Organism:
Homo sapiens (Human)
Description:
P30518
Residue:
371
  
Inhibitor
Name:
BDBM50246575
Synonyms:
1-(2-Methyl-4-(2,3,4,5-tetrahydro-1-benzazepin-1-ylcarbonyl)benzylcarbamoyl)-L-proline-N,N-dimethylamide VA-106483
Type:
Small organic molecule
Emp. Form.:
C27H34N4O3
Mol. Mass.:
462.5839
SMILES:
CN(C)C(=O)[C@@H]1CCCN1C(=O)NCc1ccc(cc1C)C(=O)N1CCCCc2ccccc12
: