Target
Neuropeptide Y receptor type 1
Ligand
BDBM50246613
Substrate
Meas. Tech.
ChEMBL_562263 (CHEMBL1011806)
Ki
12±n/a nM
Citation
 Keller, MPop, NHutzler, CBeck-Sickinger, AGBernhardt, GBuschauer, A Guanidine-acylguanidine bioisosteric approach in the design of radioligands: synthesis of a tritium-labeled N(G)-propionylargininamide ([3H]-UR-MK114) as a highly potent and selective neuropeptide Y Y1 receptor antagonist. J Med Chem 51:8168-72 (2008)  
Target
Name:
Neuropeptide Y receptor type 1
Synonyms:
NPY-Y1 NPY1R NPYR neuropeptide Y receptor Y1
Type:
Enzyme Catalytic Domain
Mol. Mass.:
44399.07
Organism:
Homo sapiens (Human)
Description:
NPY-Y1 NPY1R HUMAN::P25929
Residue:
384
  
Inhibitor
Name:
BDBM50246613
Synonyms:
(R)-N-(4-hydroxybenzyl)-5-(2-acetylguanidino)-2-(2,2-diphenylacetamido)pentanamide | CHEMBL472901
Type:
Small organic molecule
Emp. Form.:
C29H33N5O4
Mol. Mass.:
515.6034
SMILES:
CC(=O)NC(N)=NCCC[C@@H](NC(=O)C(c1ccccc1)c1ccccc1)C(=O)NCc1ccc(O)cc1
: