Target
Neuropeptide Y receptor type 1
Ligand
BDBM50246648
Substrate
Meas. Tech.
ChEMBL_562264 (CHEMBL1011807)
Ki
0.1±n/a nM
Citation
 Keller, MPop, NHutzler, CBeck-Sickinger, AGBernhardt, GBuschauer, A Guanidine-acylguanidine bioisosteric approach in the design of radioligands: synthesis of a tritium-labeled N(G)-propionylargininamide ([3H]-UR-MK114) as a highly potent and selective neuropeptide Y Y1 receptor antagonist. J Med Chem 51:8168-72 (2008)  
Target
Name:
Neuropeptide Y receptor type 1
Synonyms:
NPY-Y1 NPY1R NPYR neuropeptide Y receptor Y1
Type:
Enzyme Catalytic Domain
Mol. Mass.:
44399.07
Organism:
Homo sapiens (Human)
Description:
NPY-Y1 NPY1R HUMAN::P25929
Residue:
384
  
Inhibitor
Name:
BDBM50246648
Synonyms:
(R)-1-((5-(4-hydroxybenzylamino)-4-(2,2-diphenylacetamido)-5-oxopentylamino)(amino)methylene)-3-ethylurea | CHEMBL511460
Type:
Small organic molecule
Emp. Form.:
C30H36N6O4
Mol. Mass.:
544.6446
SMILES:
CCNC(=O)NC(N)=NCCC[C@@H](NC(=O)C(c1ccccc1)c1ccccc1)C(=O)NCc1ccc(O)cc1
: