Target
Retinoic acid receptor beta
Ligand
BDBM31883
Substrate
Meas. Tech.
ChEMBL_544806 (CHEMBL1011986)
EC50
12±n/a nM
Citation
 Charton, JDeprez-Poulain, RHennuyer, NTailleux, AStaels, BDeprez, B Novel non-carboxylic acid retinoids: 1,2,4-oxadiazol-5-one derivatives. Bioorg Med Chem Lett 19:489-92 (2008)  
Target
Name:
Retinoic acid receptor beta
Synonyms:
HAP NR1B2 RAR-beta RARB Retinoic acid receptor RXR-alpha/Retinoic acid receptor beta Retinoid receptor
Type:
PROTEIN
Mol. Mass.:
50498.70
Organism:
Homo sapiens (Human)
Description:
ChEMBL_1458015
Residue:
455
  
Inhibitor
Name:
BDBM31883
Synonyms:
9-cis-retinoic acid (9cRA) AT-RA CHEMBL38 SMR000058245 Vitamin A acid [3H]Retinoic acid [3H]tretinoin cid_444795
Type:
radiolabeled ligand
Emp. Form.:
C20H28O2
Mol. Mass.:
300.4351
SMILES:
C\C(\C=C\C1=C(C)CCCC1(C)C)=C/C=C/C(/C)=C/C(O)=O
: