Target
Arylamine N-acetyltransferase 1
Ligand
BDBM50274853
Substrate
Meas. Tech.
ChEMBL_494095 (CHEMBL942267)
IC50
600±n/a nM
Citation
 Russell, AJWestwood, IMCrawford, MHRobinson, JKawamura, ARedfield, CLaurieri, NLowe, EDDavies, SGSim, E Selective small molecule inhibitors of the potential breast cancer marker, human arylamine N-acetyltransferase 1, and its murine homologue, mouse arylamine N-acetyltransferase 2. Bioorg Med Chem 17:905-18 (2009)  
Target
Name:
Arylamine N-acetyltransferase 1
Synonyms:
AAC1 NAT1
Type:
PROTEIN
Mol. Mass.:
33898.32
Organism:
Homo sapiens (Human)
Description:
ChEMBL_1347886
Residue:
290
  
Inhibitor
Name:
BDBM50274853
Synonyms:
(Z)-5-(3'-Hydroxybenzylidene)-2-thioxothiazolidin-4-one | CHEMBL457919
Type:
Small organic molecule
Emp. Form.:
C10H7NO2S2
Mol. Mass.:
237.298
SMILES:
Oc1cccc(C=C2SC(S)=NC2=O)c1
: