Target
Arylamine N-acetyltransferase 2
Ligand
BDBM50275065
Substrate
Meas. Tech.
ChEMBL_494097 (CHEMBL942269)
IC50
20700±n/a nM
Citation
 Russell, AJWestwood, IMCrawford, MHRobinson, JKawamura, ARedfield, CLaurieri, NLowe, EDDavies, SGSim, E Selective small molecule inhibitors of the potential breast cancer marker, human arylamine N-acetyltransferase 1, and its murine homologue, mouse arylamine N-acetyltransferase 2. Bioorg Med Chem 17:905-18 (2009)  
Target
Name:
Arylamine N-acetyltransferase 2
Synonyms:
ARY2_MOUSE Nat2
Type:
PROTEIN
Mol. Mass.:
33697.98
Organism:
Mus musculus
Description:
ChEMBL_1347887
Residue:
290
  
Inhibitor
Name:
BDBM50275065
Synonyms:
(Z)-5-(4'-Fluorobenzylidene)-3-methyl-2-thioxothiazolidin-4-one | CHEMBL458790
Type:
Small organic molecule
Emp. Form.:
C11H8FNOS2
Mol. Mass.:
253.316
SMILES:
CN1C(=S)S\C(=C/c2ccc(F)cc2)C1=O
: