Target
Arylamine N-acetyltransferase 2
Ligand
BDBM50181733
Substrate
Meas. Tech.
ChEMBL_494097 (CHEMBL942269)
IC50
5700±n/a nM
Citation
 Russell, AJWestwood, IMCrawford, MHRobinson, JKawamura, ARedfield, CLaurieri, NLowe, EDDavies, SGSim, E Selective small molecule inhibitors of the potential breast cancer marker, human arylamine N-acetyltransferase 1, and its murine homologue, mouse arylamine N-acetyltransferase 2. Bioorg Med Chem 17:905-18 (2009)  
Target
Name:
Arylamine N-acetyltransferase 2
Synonyms:
ARY2_MOUSE Nat2
Type:
PROTEIN
Mol. Mass.:
33697.98
Organism:
Mus musculus
Description:
ChEMBL_1347887
Residue:
290
  
Inhibitor
Name:
BDBM50181733
Synonyms:
(Z)-3-Amino-5-(4'-chlorobenzylidene)-2-thioxothiazolidin-4-one 5-(4-chlorobenzylidene)-3-amino-4-oxo-2-thionothiazolidine | CHEMBL202068
Type:
Small organic molecule
Emp. Form.:
C10H7ClN2OS2
Mol. Mass.:
270.758
SMILES:
NN1C(=S)S\C(=C/c2ccc(Cl)cc2)C1=O
: