Target
Angiopoietin-1 receptor
Ligand
BDBM50266148
Substrate
Meas. Tech.
ChEMBL_540209 (CHEMBL1029838)
IC50
1±n/a nM
Citation
 Cee, VJCheng, ACRomero, KBellon, SMohr, CWhittington, DABak, ABready, JCaenepeel, SCoxon, ADeak, HLFretland, JGu, YHodous, BLHuang, XKim, JLLin, JLong, AMNguyen, HOlivieri, PRPatel, VFWang, LZhou, YHughes, PGeuns-Meyer, S Pyridyl-pyrimidine benzimidazole derivatives as potent, selective, and orally bioavailable inhibitors of Tie-2 kinase. Bioorg Med Chem Lett 19:424-7 (2008)  
Target
Name:
Angiopoietin-1 receptor
Synonyms:
TEK TIE2_HUMAN Tyrosine-protein kinase receptor (TIE-2) Tyrosine-protein kinase receptor TEK (p140 TEK) Tyrosine-protein kinase receptor TIE2/TEK VMCM1 p140 TEK
Type:
Enzyme
Mol. Mass.:
125835.70
Organism:
Homo sapiens (Human)
Description:
Q02763
Residue:
1124
  
Inhibitor
Name:
BDBM50266148
Synonyms:
CHEMBL465793 | N-(4-(3-(2-(methylamino)pyrimidin-4-yl)pyridin-2-yloxy)naphthalen-1-yl)-1H-benzo[d]imidazol-2-amine
Type:
Small organic molecule
Emp. Form.:
C27H21N7O
Mol. Mass.:
459.5019
SMILES:
CNc1nccc(n1)-c1cccnc1Oc1ccc(Nc2nc3ccccc3[nH]2)c2ccccc12
: