Target
D(2) dopamine receptor
Ligand
BDBM50265375
Substrate
Meas. Tech.
ChEMBL_558361 (CHEMBL954163)
Ki
122±n/a nM
Citation
 Butini, SGemma, SCampiani, GFranceschini, STrotta, FBorriello, MCeres, NRos, SCoccone, SSBernetti, MDe Angelis, MBrindisi, MNacci, VFiorini, INovellino, ECagnotto, AMennini, TSandager-Nielsen, KAndreasen, JTScheel-Kruger, JMikkelsen, JDFattorusso, C Discovery of a new class of potential multifunctional atypical antipsychotic agents targeting dopamine D3 and serotonin 5-HT1A and 5-HT2A receptors: design, synthesis, and effects on behavior. J Med Chem 52:151-69 (2009)  
Target
Name:
D(2) dopamine receptor
Synonyms:
DOPAMINE D2 DOPAMINE D2 Short Dopamine D2 receptor Drd2
Type:
G Protein-Coupled Receptor (GPCR)
Mol. Mass.:
50931.60
Organism:
Rattus norvegicus (rat)
Description:
P61169
Residue:
444
  
Inhibitor
Name:
BDBM50265375
Synonyms:
CHEMBL496531 | N-[4-[4-(2,3-Dichlorophenyl)piperazin-1-yl]butyl]3,4-dihydropyrazino[1,2-a]indol-1(2H)-one
Type:
Small organic molecule
Emp. Form.:
C25H28Cl2N4O
Mol. Mass.:
471.422
SMILES:
Clc1cccc(N2CCN(CCCCN3CCn4c(cc5ccccc45)C3=O)CC2)c1Cl
: