Target
Sphingosine 1-phosphate receptor 1
Ligand
BDBM50158348
Substrate
Meas. Tech.
ChEMBL_540418 (CHEMBL1029035)
IC50
0.47±n/a nM
Citation
 Evindar, GBernier, SGKavarana, MJDoyle, ELorusso, JKelley, MSHalley, KHutchings, AWright, ADSaha, AKHannig, GMorgan, BAWestlin, WF Synthesis and evaluation of alkoxy-phenylamides and alkoxy-phenylimidazoles as potent sphingosine-1-phosphate receptor subtype-1 agonists. Bioorg Med Chem Lett 19:369-72 (2008)  
Target
Name:
Sphingosine 1-phosphate receptor 1
Synonyms:
CHEDG1 Endothelial differentiation G-protein coupled receptor 1 S1P1 S1PR1_HUMAN Sphingosine 1-phosphate receptor Edg-1
Type:
Enzyme
Mol. Mass.:
42836.02
Organism:
Homo sapiens (Human)
Description:
P21453
Residue:
382
  
Inhibitor
Name:
BDBM50158348
Synonyms:
(2S,3R,4E)-2-amino-3-hydroxyoctadec-4-en-1-yl dihydrogen phosphate CHEMBL225155 US11584726, Example S1P sphingosine-1-phosphate
Type:
Small organic molecule
Emp. Form.:
C18H38NO5P
Mol. Mass.:
379.4718
SMILES:
CCCCCCCCCCCCC\C=C\[C@@H](O)[C@@H](N)COP(O)(O)=O
: