Target
Cannabinoid receptor 2
Ligand
BDBM50277268
Substrate
Meas. Tech.
ChEMBL_540512 (CHEMBL1030616)
Ki
81±n/a nM
Citation
 Goodman, AJAjello, CWWorm, KLe Bourdonnec, BSavolainen, MAO'Hare, HCassel, JAStabley, GJDehaven, RNLabuda, CJKoblish, MLittle, PJBrogdon, BLSmith, SADolle, RE CB2 selective sulfamoyl benzamides: optimization of the amide functionality. Bioorg Med Chem Lett 19:309-13 (2008)  
Target
Name:
Cannabinoid receptor 2
Synonyms:
CANNABINOID CB2 CB2 CB2B CNR2_HUMAN Cannabinoid CB2 receptor Cannabinoid receptor 2 (CB2R) | hCB2
Type:
G Protein-Coupled Receptor (GPCR)
Mol. Mass.:
39690.94
Organism:
Homo sapiens (Human)
Description:
P34972
Residue:
360
  
Inhibitor
Name:
BDBM50277268
Synonyms:
4-(5-(2-tert-butyl-1H-imidazol-5-yl)-2-methylphenylsulfonyl)morpholine | CHEMBL475719
Type:
Small organic molecule
Emp. Form.:
C18H25N3O3S
Mol. Mass.:
363.474
SMILES:
Cc1ccc(cc1S(=O)(=O)N1CCOCC1)-c1c[nH]c(n1)C(C)(C)C
: