Target
Cannabinoid receptor 1
Ligand
BDBM50239215
Substrate
Meas. Tech.
ChEMBL_540511 (CHEMBL1030615)
Ki
310±n/a nM
Citation
 Goodman, AJAjello, CWWorm, KLe Bourdonnec, BSavolainen, MAO'Hare, HCassel, JAStabley, GJDehaven, RNLabuda, CJKoblish, MLittle, PJBrogdon, BLSmith, SADolle, RE CB2 selective sulfamoyl benzamides: optimization of the amide functionality. Bioorg Med Chem Lett 19:309-13 (2008)  
Target
Name:
Cannabinoid receptor 1
Synonyms:
CANN6 CB-R CNR CNR1_HUMAN Cannabinoid receptor Cannabinoid receptor 1 (brain)
Type:
G Protein-Coupled Receptor (GPCR)
Mol. Mass.:
52868.96
Organism:
Homo sapiens (Human)
Description:
P21554
Residue:
472
  
Inhibitor
Name:
BDBM50239215
Synonyms:
4-methyl-3-(morpholinosulfonyl)-N-(2,2,4,4-tetramethylpentan-3-yl)benzamide | CHEMBL258242
Type:
Small organic molecule
Emp. Form.:
C21H34N2O4S
Mol. Mass.:
410.571
SMILES:
Cc1ccc(cc1S(=O)(=O)N1CCOCC1)C(=O)NC(C(C)(C)C)C(C)(C)C
: