Target
Glycogen phosphorylase, liver form
Ligand
BDBM50255975
Substrate
Meas. Tech.
ChEMBL_515050 (CHEMBL1034792)
IC50
5±n/a nM
Citation
 Sparks, SMBanker, PBickett, DMCarter, HLClancy, DCDickerson, SHDwornik, KAGarrido, DMGolden, PLNolte, RTPeat, AJSheckler, LRTavares, FXThomson, SAWang, LWeiel, JE Anthranilimide-based glycogen phosphorylase inhibitors for the treatment of type 2 diabetes: 1. Identification of 1-amino-1-cycloalkyl carboxylic acid headgroups. Bioorg Med Chem Lett 19:976-80 (2009)  
Target
Name:
Glycogen phosphorylase, liver form
Synonyms:
Glycogen Phosphorylase (PYGL) Liver glycogen phosphorylase PYGL_HUMAN
Type:
Homodimer
Mol. Mass.:
97153.98
Organism:
Homo sapiens (Human)
Description:
Dimers associate into a tetramer to form the enzymatically active phosphorylase A.
Residue:
847
  
Inhibitor
Name:
BDBM50255975
Synonyms:
(S)-2-cyclohexyl-2-(3-(3-(2,6-dichloro-4-(trifluoromethoxy)phenyl)ureido)-2-naphthamido)acetic acid | CHEMBL480195
Type:
Small organic molecule
Emp. Form.:
C27H24Cl2F3N3O5
Mol. Mass.:
598.398
SMILES:
OC(=O)[C@@H](NC(=O)c1cc2ccccc2cc1NC(=O)Nc1c(Cl)cc(OC(F)(F)F)cc1Cl)C1CCCCC1
: