Target
Glycogen phosphorylase, liver form
Ligand
BDBM50256118
Substrate
Meas. Tech.
ChEMBL_515050 (CHEMBL1034792)
IC50
132±n/a nM
Citation
 Sparks, SMBanker, PBickett, DMCarter, HLClancy, DCDickerson, SHDwornik, KAGarrido, DMGolden, PLNolte, RTPeat, AJSheckler, LRTavares, FXThomson, SAWang, LWeiel, JE Anthranilimide-based glycogen phosphorylase inhibitors for the treatment of type 2 diabetes: 1. Identification of 1-amino-1-cycloalkyl carboxylic acid headgroups. Bioorg Med Chem Lett 19:976-80 (2009)  
Target
Name:
Glycogen phosphorylase, liver form
Synonyms:
Glycogen Phosphorylase (PYGL) Liver glycogen phosphorylase PYGL_HUMAN
Type:
Homodimer
Mol. Mass.:
97153.98
Organism:
Homo sapiens (Human)
Description:
Dimers associate into a tetramer to form the enzymatically active phosphorylase A.
Residue:
847
  
Inhibitor
Name:
BDBM50256118
Synonyms:
(S)-2-(3-(3-mesitylureido)-2-naphthamido)-2-((S)-3-oxocyclohexyl)acetic acid | CHEMBL473422
Type:
Small organic molecule
Emp. Form.:
C29H31N3O5
Mol. Mass.:
501.5735
SMILES:
Cc1cc(C)c(NC(=O)Nc2cc3ccccc3cc2C(=O)N[C@@H]([C@H]2CCCC(=O)C2)C(O)=O)c(C)c1
: